Ashwin Adhin
type: Label

Person
type: Class

Adhin, Ashwin
type: Label

Adhin, Ashwin
type: Thing
type: Concept
type: Person
in set: gtaa
status: approved
date accepted: 2017-10-03T12:23:58+00:00
date submitted: 2016-07-11T22:08:50+00:00
modified: 2023-04-05T09:54:42+00:00
in scheme: Persoonsnamen
notation: 1156229
scope note: vicepresident Suriname NDP, minister van Onderwijs Suriname, hoogleraar elektrotechniek
sd license: https://creativecommons.org/publicdomain/zero/1.0/
sd publisher: www.beeldengeluid.nl

Thing
type: Class

Ashwin Adhin