Paula Jones
type: Label

Jones, Paula
type: Concept
type: Person
type: Thing
in set: gtaa
status: approved
date accepted: 2007-11-24T03:32:02+00:00
date submitted: 2007-11-24T03:32:02+00:00
modified: 2023-04-05T08:42:19+00:00
in scheme: Persoonsnamen
notation: 114155
scope note: voormalig werkneemster van Bill Clinton, die hem beschuldigde van seksuele intimidatie
sd license: https://creativecommons.org/publicdomain/zero/1.0/
sd publisher: www.beeldengeluid.nl

Thing
type: Class

Paula Jones

Jones, Paula
type: Label

Person
type: Class