Huang Hua
type: Label

Huang Hua

Thing
type: Class

Huang Hua
type: Thing
type: Concept
in set: gtaa
status: approved
date accepted: 2007-11-24T03:14:51+00:00
date submitted: 2007-11-24T03:14:51+00:00
modified: 2023-04-05T09:44:57+00:00
in scheme: Persoonsnamen
notation: 112771
scope note: politicus China, Minister van Buitenlandse Zaken
sd license: https://creativecommons.org/publicdomain/zero/1.0/
sd publisher: www.beeldengeluid.nl