Vladimir Isakov

Isakov, Vladimir
type: Concept
type: Thing
in set: gtaa
status: approved
date accepted: 2007-11-24T03:08:10+00:00
date submitted: 2007-11-24T03:08:10+00:00
modified: 2023-04-05T09:56:13+00:00
in scheme: Persoonsnamen
notation: 112212
scope note: politicus Russische Federatie parlementslid
sd license: https://creativecommons.org/publicdomain/zero/1.0/
sd publisher: www.beeldengeluid.nl

Isakov, Vladimir
type: Label

Vladimir Isakov
type: Label

Thing
type: Class