Horn, Gyula
type: Concept
type: Thing
in set: gtaa
status: approved
date accepted: 2007-11-24T03:04:31+00:00
date submitted: 2007-11-24T03:04:31+00:00
modified: 2023-04-05T09:52:02+00:00
in scheme: Persoonsnamen
notation: 111917
scope note: politicus Hongarije ex-min. buitenlandse zaken
sd license: https://creativecommons.org/publicdomain/zero/1.0/
sd publisher: www.beeldengeluid.nl

Gyula Horn
type: Label

Gyula Horn

Thing
type: Class

Horn, Gyula
type: Label