Hitrec, Hrvoje
type: Label

Hitrec, Hrvoje
type: Thing
type: Concept
in set: gtaa
status: approved
date accepted: 2007-11-24T02:41:51+00:00
date submitted: 2007-11-24T02:41:51+00:00
modified: 2023-04-05T08:19:58+00:00
in scheme: Persoonsnamen
notation: 110034
scope note: politicus Joegoslavië min. informatie Kroatië
sd license: https://creativecommons.org/publicdomain/zero/1.0/
sd publisher: www.beeldengeluid.nl

Thing
type: Class

Hrvoje Hitrec
type: Label

Hrvoje Hitrec