Sidney George Holland
type: Label

Holland, Sidney George
type: Label

Holland, Sidney George
type: Concept
type: Thing
in set: gtaa
status: approved
date accepted: 2007-11-24T02:37:42+00:00
date submitted: 2007-11-24T02:37:42+00:00
modified: 2023-04-05T08:30:47+00:00
in scheme: Persoonsnamen
notation: 109683
scope note: politicus Nieuw-Zeeland premier 1949-1957
sd license: https://creativecommons.org/publicdomain/zero/1.0/
sd publisher: www.beeldengeluid.nl

Thing
type: Class

Sidney Holland