Heng Samrin
type: Concept
in set: gtaa
status: approved
date accepted: 2007-11-24T02:27:44+00:00
date submitted: 2007-11-24T02:27:44+00:00
modified: 2023-04-05T08:55:35+00:00
in scheme: Persoonsnamen
notation: 108801
scope note: secr.-gen. Communistische Partij Cambodja
sd license: https://creativecommons.org/publicdomain/zero/1.0/
sd publisher: www.beeldengeluid.nl

Heng Samrin

Heng Samrin
type: Label