Hager, Kurt
type: Thing
type: Concept
in set: gtaa
status: approved
date accepted: 2007-11-24T01:57:57+00:00
date submitted: 2007-11-24T01:57:57+00:00
modified: 2023-04-05T08:34:29+00:00
in scheme: Persoonsnamen
notation: 106071
scope note: politicus Oost-Duitsland ex-partij-ideoloog
sd license: https://creativecommons.org/publicdomain/zero/1.0/
sd publisher: www.beeldengeluid.nl

Kurt Hager
type: Label

Kurt Hager

Hager, Kurt
type: Label

Thing
type: Class