Bernhard Goetz
type: Label

Goetz, Bernhard
type: Thing
type: Concept
in set: gtaa
status: approved
date accepted: 2007-11-24T01:27:20+00:00
date submitted: 2007-11-24T01:27:20+00:00
modified: 2023-04-05T08:33:41+00:00
in scheme: Persoonsnamen
notation: 102937
scope note: schoot vier aanvallers in VS New York metro dood
sd license: https://creativecommons.org/publicdomain/zero/1.0/
sd publisher: www.beeldengeluid.nl

Bernhard Goetz

Goetz, Bernhard
type: Label

Thing
type: Class