Gennes, Pierre Gilles de
type: Thing
type: Concept
in set: gtaa
status: approved
date accepted: 2007-11-24T01:13:37+00:00
date submitted: 2007-11-24T01:13:37+00:00
modified: 2023-04-05T08:16:56+00:00
in scheme: Persoonsnamen
notation: 101477
scope note: natuurkundige Frankrijk Nobelprijswinnaar
sd license: https://creativecommons.org/publicdomain/zero/1.0/
sd publisher: www.beeldengeluid.nl

Thing
type: Class

Gennes, Pierre Gilles de
type: Label

de Gennes, Pierre Gilles
type: Label

Pierre Gilles de Gennes
type: Label

Pierre-Gilles de Gennes