André Giraud

Giraud, André
type: Thing
type: Concept
in set: gtaa
status: approved
date accepted: 2007-11-24T01:08:58+00:00
date submitted: 2007-11-24T01:08:58+00:00
modified: 2023-04-05T09:03:54+00:00
in scheme: Persoonsnamen
notation: 100979
scope note: politicus Frankrijk, minister 1978-1981 en 1986-1988
sd license: https://creativecommons.org/publicdomain/zero/1.0/
sd publisher: www.beeldengeluid.nl

Thing
type: Class

André Giraud
type: Label

Giraud, André
type: Label