Thing
type: Class

Fischer, Edmond
type: Label

Edmond Fischer
type: Label

Edmond H. Fischer

Fischer, Edmond
type: Concept
type: Thing
in set: gtaa
status: approved
date accepted: 2007-11-24T00:50:26+00:00
date submitted: 2007-11-24T00:50:26+00:00
modified: 2023-04-05T09:42:13+00:00
in scheme: Persoonsnamen
notation: 98931
scope note: biochemicus VS Nobelprijs geneeskunde 1992
sd license: https://creativecommons.org/publicdomain/zero/1.0/
sd publisher: www.beeldengeluid.nl