Cosic, Dobriça
type: Label

Dobrica Ćosić

Dobriça Cosic
type: Label

Thing
type: Class

Cosic, Dobriça
type: Thing
type: Concept
in set: gtaa
status: approved
date accepted: 2007-11-23T23:41:52+00:00
date submitted: 2007-11-23T23:41:52+00:00
modified: 2023-04-05T08:50:46+00:00
in scheme: Persoonsnamen
notation: 90607
scope note: politicus Joegoslavië president juni '92 -
sd license: https://creativecommons.org/publicdomain/zero/1.0/
sd publisher: www.beeldengeluid.nl