Person
type: Class

Alberda, Joop
type: Concept
type: Thing
type: Person
in set: gtaa
status: approved
date accepted: 2007-11-23T22:10:03+00:00
date submitted: 2007-11-23T22:10:03+00:00
modified: 2014-03-21T12:01:17+00:00
in scheme: Persoonsnamen
notation: 76569
scope note: allround sportbestuurder, technisch directeur NOC*NSF, chef de mission OS 2000 en 2004, volleybalcoach
sd license: https://creativecommons.org/publicdomain/zero/1.0/
sd publisher: www.beeldengeluid.nl

Thing
type: Class

Joop Alberda
type: Label

Alberda, Joop
type: Label