Hannes Alfvén
type: Label

Hannes Alfvén

Alfvén, Hannes
type: Concept
type: Thing
in set: gtaa
status: approved
date accepted: 2007-11-23T22:07:15+00:00
date submitted: 2007-11-23T22:07:15+00:00
modified: 2023-04-05T09:35:55+00:00
in scheme: Persoonsnamen
notation: 76057
scope note: natuurkundige Zweden Nobelprijswinnaar 1970
sd license: https://creativecommons.org/publicdomain/zero/1.0/
sd publisher: www.beeldengeluid.nl

Thing
type: Class

Alfvén, Hannes
type: Label