Vrienden van Amelisweerd
type: Concept
type: Thing
in set: gtaa
status: approved
date accepted: 2007-11-23T20:10:57+00:00
date submitted: 2007-11-23T20:10:57+00:00
modified: 2013-01-14T12:44:36+00:00
in scheme: Namen
notation: 72948
scope note: belangengroep natuurgebied, voorheen actiegroep
sd license: https://creativecommons.org/publicdomain/zero/1.0/
sd publisher: www.beeldengeluid.nl

Thing
type: Class

Vrienden van Amelisweerd
type: Label