RNO
type: Label

TNO
type: Concept
type: Thing
in set: gtaa
status: approved
date accepted: 2007-11-23T20:03:33+00:00
date submitted: 2007-11-23T20:03:33+00:00
modified: 2021-01-28T15:01:36+00:00
in scheme: Namen
notation: 71952
scope note: instituut toegepast natuurwetenschappelijk onderzoek
sd license: https://creativecommons.org/publicdomain/zero/1.0/
sd publisher: www.beeldengeluid.nl

Nederlandse Organisatie Toegepast Natuurwet. Onderzoek
type: Label

Thing
type: Class

TNO
type: Label