Limburgs Landschap
type: Label

Thing
type: Class

Stichting Het Limburgs Landschap
type: Label

Stichting Het Limburgs Landschap
type: Thing
type: Concept
in set: gtaa
status: approved
date accepted: 2007-11-23T19:51:53+00:00
date submitted: 2007-11-23T19:51:53+00:00
modified: 2013-06-10T13:13:57+00:00
in scheme: Namen
notation: 70394
scope note: natuurbeschermingsorganisatie in de provincie Limburg
sd license: https://creativecommons.org/publicdomain/zero/1.0/
sd publisher: www.beeldengeluid.nl