Paleis Het Loo
type: Label

Het Loo
type: Label

Rijksmuseum Paleis Het Loo
type: Label

Thing
type: Class

Paleis Het Loo
type: Thing
type: Concept
in set: gtaa
status: approved
date accepted: 2007-11-23T19:17:45+00:00
date submitted: 2007-11-23T19:17:45+00:00
modified: 2015-05-20T15:15:02+00:00
in scheme: Namen
notation: 65474
scope note: museum, vml. koninklijk paleis in Apeldoorn
sd license: https://creativecommons.org/publicdomain/zero/1.0/
sd publisher: www.beeldengeluid.nl