Vereniging Natuurmonumenten
type: Label

Vereniging tot Behoud van Natuurmonumenten
type: Label

Natuurmonumenten
type: Thing
type: Concept
in set: gtaa
status: approved
date accepted: 2007-11-23T19:01:12+00:00
date submitted: 2007-11-23T19:01:12+00:00
modified: 2008-07-15T11:42:01+00:00
in scheme: Namen
notation: 62912
scope note: vereniging ter bescherming van natuur, landschap en cultuurhistorie
sd license: https://creativecommons.org/publicdomain/zero/1.0/
sd publisher: www.beeldengeluid.nl

Thing
type: Class

Natuurmonumenten
type: Label