Oezbekistan
type: Label

Thing
type: Class

Oezbekistan
type: Concept
type: Thing
in set: gtaa
status: approved
date accepted: 2007-11-23T16:24:14+00:00
date submitted: 2007-11-23T16:24:14+00:00
modified: 2017-09-26T09:37:22+00:00
in scheme: GeografischeNamen
notation: 40220
scope note: Centraal-Azië, voorheen republiek Sovjet-Unie
sd license: https://creativecommons.org/publicdomain/zero/1.0/
sd publisher: www.beeldengeluid.nl