Vejvanovsky, Pavel Josef
type: Label

Person
type: Class

Pavel Josef Vejvanovský
type: Label

Vejvanovský, Pavel Josef
type: Label

Vejvanovský, Pavel Josef
type: Person
type: Concept
in set: gtaa
status: approved
date accepted: 2018-02-05T14:14:27+00:00
date submitted: 2016-05-09T11:07:22+00:00
modified: 2024-05-27T07:57:16+00:00
in scheme: Persoonsnamen
notation: 263452
scope note: componist, dirigent, trompettist, organist
sd license: https://creativecommons.org/publicdomain/zero/1.0/
sd publisher: www.beeldengeluid.nl

Pavel Josef Vejvanovský