Esther Lauren Povitsky
type: Label

Little Esther
type: Label

Person
type: Class

Little Esther
type: Concept
type: Person
in set: gtaa
status: approved
date accepted: 2017-05-11T13:28:18+00:00
date submitted: 2016-04-14T09:41:26+00:00
modified: 2023-04-05T09:08:39+00:00
in scheme: Persoonsnamen
notation: 261826
scope note: zangeres, artiestennaam van Esther Lauren Povitsky
sd license: https://creativecommons.org/publicdomain/zero/1.0/
sd publisher: www.beeldengeluid.nl

Povitsky, Esther Lauren
type: Label

Esther Phillips