Christian Friedrich Henrici

Picander (dichter)
type: Person
type: Concept
in set: gtaa
qualifier: dichter
status: approved
date accepted: 2017-08-17T13:58:18+00:00
date submitted: 2016-03-14T20:26:13+00:00
modified: 2023-04-05T09:18:04+00:00
in scheme: Persoonsnamen
notation: 259215
scope note: tekstschrijver, dichter, pseudoniem van Christian Friedrich Henrici
sd license: https://creativecommons.org/publicdomain/zero/1.0/
sd publisher: www.beeldengeluid.nl

Henrici, Christian Friedrich
type: Label

Christian Friedrich Henrici
type: Label

Picander (dichter)
type: Label

Person
type: Class