Dombrovskis, Valdis
type: Person
type: Concept
in set: gtaa
status: approved
date accepted: 2015-01-20T09:27:00+00:00
date submitted: 2015-01-19T13:08:34+00:00
modified: 2023-04-05T08:20:02+00:00
in scheme: Persoonsnamen
notation: 255399
scope note: vicevoorzitter Europese Commissie, premier Letland
sd license: https://creativecommons.org/publicdomain/zero/1.0/
sd publisher: www.beeldengeluid.nl

Valdis Dombrovskis
type: Label

Person
type: Class

Valdis Dombrovskis

Dombrovskis, Valdis
type: Label