Milieu Centraal
type: Concept
type: Thing
in set: gtaa
status: approved
date accepted: 2013-08-14T16:00:05+00:00
date submitted: 2013-07-02T18:54:54+00:00
modified: 2013-08-14T16:00:05+00:00
in scheme: Namen
notation: 236410
scope note: voorlichtingsorganisatie op het gebied van energie en milieu
sd license: https://creativecommons.org/publicdomain/zero/1.0/
sd publisher: www.beeldengeluid.nl

Milieu Centraal
type: Label

Thing
type: Class