Steinbrück, Peer
type: Label

Peer Steinbrück
type: Label

Person
type: Class

Peer Steinbrück

Thing
type: Class

Steinbrück, Peer
type: Thing
type: Concept
type: Person
in set: gtaa
status: approved
date accepted: 2012-11-14T14:58:41+00:00
date submitted: 2012-10-02T13:19:06+00:00
modified: 2023-04-05T09:12:42+00:00
in scheme: Persoonsnamen
notation: 233341
scope note: partijleider SPD; minister van Financiën Duitsland, minister-president Noordrijn-Westfalen
sd license: https://creativecommons.org/publicdomain/zero/1.0/
sd publisher: www.beeldengeluid.nl