Zadoks, Jan Carel
type: Label

Thing
type: Class

Jan Carel Zadoks
type: Label

Jan Carel Zadoks

Person
type: Class

Zadoks, Jan Carel
type: Concept
type: Person
type: Thing
in set: gtaa
status: approved
date accepted: 2011-12-15T08:41:41+00:00
date submitted: 2011-12-06T10:26:58+00:00
modified: 2023-04-05T08:12:36+00:00
in scheme: Persoonsnamen
notation: 230731
scope note: hoogleraar ecologische fytopathologie (plantenziekten), verzamelaar sinterklaas-inpakpapier
sd license: https://creativecommons.org/publicdomain/zero/1.0/
sd publisher: www.beeldengeluid.nl