Uri Rosenthal

Thing
type: Class

Person
type: Class

Rosenthal, Uri
type: Label

Rosenthal, Uri
type: Person
type: Thing
type: Concept
in set: gtaa
status: approved
date accepted: 2010-10-21T10:42:40+00:00
date submitted: 2010-10-13T15:55:48+00:00
modified: 2023-04-05T09:24:56+00:00
in scheme: Persoonsnamen
notation: 224677
scope note: minister Buitenlandse Zaken VVD, fractievoorzitter VVD Eerste Kamer, voorzitter COT, hoogleraar bestuurskunde
sd license: https://creativecommons.org/publicdomain/zero/1.0/
sd publisher: www.beeldengeluid.nl

Uri Rosenthal
type: Label