Klaver, Jesse
type: Label

Klaver, Jesse
type: Thing
type: Concept
type: Person
in set: gtaa
status: approved
date accepted: 2009-09-24T13:19:14+00:00
date submitted: 2009-08-13T14:49:42+00:00
modified: 2023-04-05T09:05:45+00:00
in scheme: Persoonsnamen
notation: 214232
scope note: fractievoorzitter GroenLinks Tweede Kamer, voorzitter DWARS, jongerenorganisatie GroenLinks
sd license: https://creativecommons.org/publicdomain/zero/1.0/
sd publisher: www.beeldengeluid.nl

Jesse Klaver
type: Label

Person
type: Class

Jesse Klaver

Thing
type: Class