Michelinster
type: Thing
type: Concept
in set: gtaa
status: approved
date accepted: 2009-02-11T11:51:05+00:00
date submitted: 2009-01-15T09:42:10+00:00
modified: 2021-02-16T11:35:04+00:00
in scheme: Namen
notation: 212423
scope note: culinaire onderscheiding voor restaurants, toegekend door bandenfabrikant Michelin
sd license: https://creativecommons.org/publicdomain/zero/1.0/
sd publisher: www.beeldengeluid.nl

Michelin ster
type: Label

Thing
type: Class

Michelinster
type: Label