Thing
type: Class

simulatie (game)
type: Label

simulatie (game)
type: Concept
type: Thing
in set: gtaa
qualifier: game
status: approved
date accepted: 2024-08-14T10:51:52+00:00
date submitted: 2024-08-13T13:47:34+00:00
modified: 2024-08-14T10:51:52+00:00
example: Kayak VR: Mirage, Flight Deck, Sprinter, Microsoft Flight Simulator
in scheme: Genre
notation: 1747564
scope note: Een game waarin een specifieke handeling of proces wordt gesimuleerd. De speler kan de spelwereld aansturen door personages, objecten en systemen aan te sturen, maar is altijd onderhevig aan de regels van de simulatie. Vaak moet de speler specifieke doelen en uitdagingen voltooien die een accurate reflectie proberen te zijn van het proces in de werkelijkheid.
pref label: simulatie (game)
sd license: https://creativecommons.org/publicdomain/zero/1.0/
sd publisher: www.beeldengeluid.nl