educatief (game)
type: Concept
type: Thing
in set: gtaa
qualifier: game
status: approved
date accepted: 2024-08-14T10:51:51+00:00
date submitted: 2024-08-13T13:47:33+00:00
modified: 2024-08-14T10:51:51+00:00
example: RedCat en de Snelle Sommenrace, Meesters van Macht, Topografie Nederland
in scheme: Genre
notation: 1747550
scope note: Een game dat als doel heeft om de speler (schoolse) kennis over te dragen. De speler lost uitdagingen, opdrachten en situaties op door gebruik te maken van algemene (wereld)kennis zoals bijvoorbeeld talen, rekenopdrachten, topografie, geschiedenis, natuur- en/of scheikunde.
pref label: educatief (game)
sd license: https://creativecommons.org/publicdomain/zero/1.0/
sd publisher: www.beeldengeluid.nl

educatief (game)
type: Label

Thing
type: Class