cardgame (game)
type: Label

cardgame (game)
type: Concept
in set: gtaa
qualifier: game
status: approved
date accepted: 2024-08-14T10:51:50+00:00
date submitted: 2024-08-13T13:47:32+00:00
modified: 2024-08-14T10:51:50+00:00
example: Stacklands, Inscryption, Balatro, Hearthstone, Gwent
in scheme: Genre
notation: 1747549
scope note: Een game waarin het spel gespeeld wordt door middel van kaarten. Dit kan gaan om traditionele speelkaarten of een spel dat met eigen regels en/of speelkaarten werkt. De speler gebruikt voornamelijk kaarten om te reageren in en op de game.
pref label: cardgame (game)
sd license: https://creativecommons.org/publicdomain/zero/1.0/
sd publisher: www.beeldengeluid.nl