applied game (game)
type: Concept
type: Thing
in set: gtaa
qualifier: game
status: approved
date accepted: 2024-08-14T10:51:50+00:00
date submitted: 2024-08-13T13:47:32+00:00
modified: 2024-08-14T10:51:50+00:00
example: Underground, de Tovertafel, Het Spel van de Gouden Eeuw
in scheme: Genre
notation: 1747547
scope note: Een game die is geproduceerd met als doel om kennis over te dragen of om spelenderwijs de mogelijkheid te bieden voor training, inleving en kennisdeling. Soms door gebruik van immersieve technieken en accessoires die de drempel voor spelers kunnen verlagen.
pref label: applied game (game)
sd license: https://creativecommons.org/publicdomain/zero/1.0/
sd publisher: www.beeldengeluid.nl

applied game (game)
type: Label

Thing
type: Class