advergame (game)
type: Label

advergame (game)
type: Thing
type: Concept
in set: gtaa
qualifier: game
status: approved
date accepted: 2024-08-14T10:51:50+00:00
date submitted: 2024-08-13T13:47:32+00:00
modified: 2024-08-14T10:51:50+00:00
example: NS Tech Tracks, KLM: Aviation Empire, Red Bull: Formula Face, Pepsi Man
in scheme: Genre
notation: 1747546
scope note: Een game die geproduceerd is in opdracht met als doel om een ander product of dienst te verkopen of te promoten. Het geadverteerde merk, boodschap of dienst wordt expliciet en meermaals aan de speler gepresenteerd tijdens het spelen.
pref label: advergame (game)
sd license: https://creativecommons.org/publicdomain/zero/1.0/
sd publisher: www.beeldengeluid.nl

Thing
type: Class