Rehavam Ze'evi

Rehavam Zeevi
type: Label

Thing
type: Class

Zeevi, Rehavam
type: Thing
type: Concept
in set: gtaa
status: approved
date accepted: 2007-11-24T18:48:55+00:00
date submitted: 2007-11-24T18:48:55+00:00
modified: 2023-04-05T09:48:42+00:00
in scheme: Persoonsnamen
notation: 172735
scope note: politicus Israël Moledat min. zonder portefeuille
sd license: https://creativecommons.org/publicdomain/zero/1.0/
sd publisher: www.beeldengeluid.nl

Zeevi, Rehavam
type: Label