quarantaine
type: Label

infectieziekten
type: Concept
preferred label: infectious diseases @en

quarantine
type: Label

besmettelijke ziekten
type: Concept
preferred label: contageous diseases @en

quarantaine
type: Concept
in set: gtaa
status: approved
date accepted: 2020-04-07T14:36:09+00:00
date submitted: 2020-04-07T14:15:25+00:00
modified: 2023-06-30T13:11:09+00:00
in scheme: OnderwerpenBenG
notation: 1715046
preferred label: quarantine @en
related: infectieziekten
related: besmettelijke ziekten
scope note: het afzonderen van mensen en dieren voor een bepaalde tijd, om het risico dat deze andere mensen of dieren besmetten te verkleinen
pref label: quarantine
sd license: https://creativecommons.org/publicdomain/zero/1.0/
sd publisher: www.beeldengeluid.nl