Abdelhafid Douzi
type: Label

Douzi, Abdelhafid
type: Label

Cheb Douzi
type: Label

Person
type: Class

Douzi

Cheb Douzi
type: Person
type: Concept
in set: gtaa
status: approved
date accepted: 2017-08-28T15:43:20+00:00
date submitted: 2017-08-09T09:27:59+00:00
modified: 2024-05-24T08:06:56+00:00
in scheme: Persoonsnamen
notation: 1672871
scope note: zanger, artiestennaam van Abdelhafid Douzi
sd license: https://creativecommons.org/publicdomain/zero/1.0/
sd publisher: www.beeldengeluid.nl