Charley Toorop

Toorop, Charley
type: Thing
type: Concept
in set: gtaa
status: approved
date accepted: 2007-11-24T15:13:11+00:00
date submitted: 2007-11-24T15:13:11+00:00
modified: 2023-04-05T09:07:55+00:00
in scheme: Persoonsnamen
notation: 161430
scope note: schilderes 20e eeuw/dochter van Jan Toorop
sd license: https://creativecommons.org/publicdomain/zero/1.0/
sd publisher: www.beeldengeluid.nl

Charley Toorop
type: Label

Thing
type: Class

Toorop, Charley
type: Label