Keely Smith

Smith, Keely
type: Concept
type: Person
in set: gtaa
status: approved
date accepted: 2016-09-08T11:41:42+00:00
date submitted: 2016-07-13T15:57:23+00:00
modified: 2024-05-24T08:30:14+00:00
in scheme: Persoonsnamen
notation: 1446395
scope note: zangeres, artiestennaam van Dorothy Jacqueline Keely
sd license: https://creativecommons.org/publicdomain/zero/1.0/
sd publisher: www.beeldengeluid.nl

Person
type: Class

Smith, Keeley
type: Label

Smith, Keely
type: Label

Keely Smith
type: Label