Method Man
type: Person
type: Concept
in set: gtaa
status: approved
date accepted: 2016-12-01T09:08:55+00:00
date submitted: 2016-07-13T15:57:10+00:00
modified: 2023-04-05T08:41:17+00:00
in scheme: Persoonsnamen
notation: 1362870
scope note: rapper, artiesten naam van Clifford Smith
sd license: https://creativecommons.org/publicdomain/zero/1.0/
sd publisher: www.beeldengeluid.nl

Smith, Clifford
type: Label

Method Man
type: Label

Method Man

Clifford Smith
type: Label

Person
type: Class