Person
type: Class

Meridor, Dan
type: Person
type: Concept
type: Thing
in set: gtaa
status: approved
date accepted: 2007-11-24T07:19:23+00:00
date submitted: 2007-11-24T07:19:23+00:00
modified: 2023-04-05T08:32:22+00:00
in scheme: Persoonsnamen
notation: 131960
scope note: vice-premier Israël Likoed Partij, minister van Nationale Veiligheid, woordvoerder regering
sd license: https://creativecommons.org/publicdomain/zero/1.0/
sd publisher: www.beeldengeluid.nl

Dan Meridor

Dan Meridor
type: Label

Thing
type: Class

Meridor, Dan
type: Label