Manea Mănescu

Manea Manescu
type: Label

Manescu, Manea
type: Label

Manescu, Manea
type: Concept
type: Thing
in set: gtaa
status: approved
date accepted: 2007-11-24T06:41:32+00:00
date submitted: 2007-11-24T06:41:32+00:00
modified: 2023-04-05T09:13:18+00:00
in scheme: Persoonsnamen
notation: 129213
scope note: politicus Roemenië ex-medewerker Ceausescu
sd license: https://creativecommons.org/publicdomain/zero/1.0/
sd publisher: www.beeldengeluid.nl

Thing
type: Class