Letelier, Orlando
type: Label

Letelier, Orlando
type: Thing
type: Concept
in set: gtaa
status: approved
date accepted: 2007-11-24T05:55:22+00:00
date submitted: 2007-11-24T05:55:22+00:00
modified: 2023-04-05T08:35:17+00:00
in scheme: Persoonsnamen
notation: 125730
scope note: politicus Chili Min. van Defensie vermoord in VS
sd license: https://creativecommons.org/publicdomain/zero/1.0/
sd publisher: www.beeldengeluid.nl

Thing
type: Class

Orlando Letelier

Orlando Letelier
type: Label