Alexei Jablokov
type: Label

Thing
type: Class

Jablokov, Alexei
type: Thing
type: Concept
in set: gtaa
status: approved
date accepted: 2007-11-24T03:34:25+00:00
date submitted: 2007-11-24T03:34:25+00:00
modified: 2023-04-05T08:15:16+00:00
in scheme: Persoonsnamen
notation: 114343
scope note: politicus USSR parlementslid, voorz. Greenpeace
sd license: https://creativecommons.org/publicdomain/zero/1.0/
sd publisher: www.beeldengeluid.nl

Jablokov, Alexei
type: Label

Aleksey Yablokov