Howard Hughes

Person
type: Class

Hughes, Howard
type: Person
type: Thing
type: Concept
in set: gtaa
status: approved
date accepted: 2007-11-24T02:51:22+00:00
date submitted: 2007-11-24T02:51:22+00:00
modified: 2023-04-05T08:41:21+00:00
in scheme: Persoonsnamen
notation: 110835
scope note: piloot, filmproducent, filmregisseur, vliegtuigbouwer, playboy, excentriekeling, filantroop en kluizenaar
sd license: https://creativecommons.org/publicdomain/zero/1.0/
sd publisher: www.beeldengeluid.nl

Thing
type: Class

Howard Hughes
type: Label

Hughes, Howard
type: Label