Gratz, Leopold
type: Concept
type: Thing
in set: gtaa
status: approved
date accepted: 2007-11-24T01:39:50+00:00
date submitted: 2007-11-24T01:39:50+00:00
modified: 2023-04-05T09:44:13+00:00
in scheme: Persoonsnamen
notation: 104237
scope note: politicus Oostenrijk, Minister van Buitenlandse Zaken
sd license: https://creativecommons.org/publicdomain/zero/1.0/
sd publisher: www.beeldengeluid.nl

Leopold Gratz
type: Label

Leopold Gratz

Gratz, Leopold
type: Label

Thing
type: Class