Enrique Tierno Galvan
type: Label

Galvan, Enrique Tierno
type: Label

Enrique Tierno Galván

Thing
type: Class

Galvan, Enrique Tierno
type: Concept
type: Thing
in set: gtaa
status: approved
date accepted: 2007-11-24T01:07:04+00:00
date submitted: 2007-11-24T01:07:04+00:00
modified: 2023-04-05T08:30:40+00:00
in scheme: Persoonsnamen
notation: 100775
scope note: politicus Spanje burg. Madrid, vz. Social. Volkspartij
sd license: https://creativecommons.org/publicdomain/zero/1.0/
sd publisher: www.beeldengeluid.nl